﻿_id,anno_dichiarazione,anno_imposta,codice_istat_comune,denominazione_comune,sigla_provincia,totale_contribuenti,contribuenti_fascia_reddito1,ammontare_fascia_reddito1,contribuenti_fascia_reddito2,ammontare_fascia_reddito2,contribuenti_fascia_reddito3,ammontare_fascia_reddito3,contribuenti_fascia_reddito4,ammontare_fascia_reddito4,contribuenti_fascia_reddito5,ammontare_fascia_reddito5,contribuenti_fascia_reddito6,ammontare_fascia_reddito6,contribuenti_fascia_reddito7,ammontare_fascia_reddito7,contribuenti_fascia_reddito8,ammontare_fascia_reddito8
1,2022,2021,52001,ABBADIA SAN SALVATORE,SI,4833,0,0,1279,5716757,699,8742352,1876,37778285,790,26756875,66,4183252,48,4453405,10,1650640
2,2022,2021,47002,AGLIANA,PT,12923,,,2860,14667600,1841,22973767,4858,98506864,2745,92144621,217,13739378,122,11203213,43,10465643
3,2022,2021,46001,ALTOPASCIO,LU,10794,0,0,2860,13185814,1505,18830199,3733,76807383,2196,74164467,163,10291119,82,7456610,45,10118824
4,2022,2021,51001,ANGHIARI,AR,4241,,,1022,4877659,684,8646187,1505,30096789,816,27135477,65,4086648,37,3302395,21,4170239
5,2022,2021,53001,ARCIDOSSO,GR,3180,0,0,875,4165666,500,6279760,1111,22421324,557,18589522,34,2168682,41,3661347,11,1880750
6,2022,2021,51002,AREZZO,AR,73113,10,-30941,16662,76589465,9190,116509960,24706,501661122,16882,583674693,1801,114870506,1385,127555200,743,168952457
7,2022,2021,52002,ASCIANO,SI,5136,0,0,1175,5409946,667,8438896,1836,37638697,1188,40451407,99,6218792,53,4700349,21,3547667
8,2022,2021,52033,SINALUNGA,SI,9171,0,0,2228,10726097,1266,16006984,3353,67600672,1816,62643153,168,10707090,123,11385119,44,8312172
9,2022,2021,45001,AULLA,MS,7806,,,1893,8929623,973,12178115,2713,55500151,1831,62556570,139,8829712,79,7170286,24,4301955
10,2022,2021,51003,BADIA TEDALDA,AR,784,0,0,250,1205521,131,1621462,253,5019073,122,3993130,8,515739,5,451862,0,0
11,2022,2021,46002,BAGNI DI LUCCA,LU,4096,0,0,1363,6168116,656,8228752,1205,24425852,718,24076323,40,2511260,30,2749963,9,1487728
12,2022,2021,47011,MONTECATINI-TERME,PT,14560,,,4447,20550789,1978,24579601,4093,82866712,2778,96677347,339,21900016,279,25574088,157,29353640
13,2022,2021,50031,SAN GIULIANO TERME,PI,22731,4,-43171,4840,21943128,2388,29998943,6919,142767610,6488,224167260,730,46589979,657,60424809,219,39414052
14,2022,2021,48001,BAGNO A RIPOLI,FI,19196,,,4029,18712874,2290,28708495,5767,117576076,4950,175278481,725,45977192,550,51192634,375,99999985
15,2022,2021,45002,BAGNONE,MS,1341,0,0,383,1851483,213,2681606,411,8282941,271,9255011,19,1177171,16,1497265,8,1921785
16,2022,2021,48002,BARBERINO DI MUGELLO,FI,8164,0,0,1707,8268425,1010,12732184,2914,60295213,2058,70512748,182,11550455,91,8519206,47,8244892
17,2022,2021,46003,BARGA,LU,7142,0,0,1740,7890537,894,11172778,2294,47269569,1849,61984889,139,8827874,86,8056008,36,8893947
18,2022,2021,51004,BIBBIENA,AR,8887,0,0,1950,9345434,1207,15267204,3379,68636142,1857,63363072,151,9641892,117,10865474,57,10797609
19,2022,2021,49001,BIBBONA,LI,2488,0,0,753,3865765,397,4940077,749,15049366,446,15008873,39,2462731,25,2374213,17,2576603
20,2022,2021,50001,BIENTINA,PI,6156,,,1326,6311150,792,9957963,2166,44454596,1500,51423117,121,7671258,82,7529969,42,8522688
21,2022,2021,46004,BORGO A MOZZANO,LU,4999,,,1254,6013858,711,8898971,1659,34088460,1152,38160908,78,4888339,36,3315431,17,4297875
22,2022,2021,48004,BORGO SAN LORENZO,FI,13774,0,0,2907,13362623,1648,20731145,5005,102691415,3428,115345558,281,17921851,180,16368267,84,17425245
23,2022,2021,51005,BUCINE,AR,7651,,,1691,8459822,1000,12664192,2964,60510883,1639,55872130,121,7685090,81,7287480,42,7517421
24,2022,2021,47003,BUGGIANO,PT,6368,0,0,1684,7767152,880,10980366,2086,42508424,1254,43324997,134,8525168,98,9022131,55,10306832
25,2022,2021,52003,BUONCONVENTO,SI,2288,0,0,502,2399237,290,3646725,885,18098620,485,16401177,46,2894806,23,2109930,11,2382620
26,2022,2021,50002,BUTI,PI,4186,0,0,948,4733425,592,7516707,1620,33105802,829,27825653,54,3468111,42,3897163,23,4231446
27,2022,2021,50003,CALCI,PI,4599,0,0,971,4482325,524,6556221,1410,28845197,1222,42915370,162,10435806,139,12755053,54,9306661
28,2022,2021,50004,CALCINAIA,PI,9189,0,0,1780,8703186,1051,13255499,3411,70300361,2375,81214912,209,13161644,130,12018918,51,11958022
29,2022,2021,48005,CALENZANO,FI,13731,,,2650,12882722,1547,19598553,4828,99341236,3764,130662505,331,20787261,260,24080502,124,27152538
30,2022,2021,46005,CAMAIORE,LU,23508,,,6848,33050718,3444,42887846,6698,135419920,4510,158283166,581,36991056,453,41498141,235,48993949
31,2022,2021,53002,CAMPAGNATICO,GR,1844,0,0,576,2822886,337,4216618,538,10722393,301,10151361,17,1053994,13,1126005,5,739369
32,2022,2021,48006,CAMPI BISENZIO,FI,34284,,,8539,43574584,4668,58535879,11974,243788143,7339,251588683,546,34521660,343,31798764,168,34030940
33,2022,2021,49002,CAMPIGLIA MARITTIMA,LI,9783,,,2592,12077829,1449,18084696,3287,67746817,1958,65403693,141,8858917,113,10431221,56,9940968
34,2022,2021,49003,CAMPO NELL'ELBA,LI,3761,0,0,1202,6210986,637,7930174,972,19186109,657,23054624,96,6101564,69,6281201,32,5661722
35,2022,2021,46006,CAMPORGIANO,LU,1574,0,0,416,1898930,199,2522266,511,10560126,382,12529361,18,1137848,14,1348809,,
36,2022,2021,100001,CANTAGALLO,PO,2333,0,0,506,2448099,284,3574593,888,18279843,558,18629714,34,2189139,21,1926205,6,1048017
37,2022,2021,53003,CAPALBIO,GR,3067,,,1040,5147462,490,6084341,815,16158539,464,16451552,52,3328508,59,5368077,57,25454850
38,2022,2021,50005,CAPANNOLI,PI,4595,,,1046,4887294,642,8105676,1715,34969422,969,32812712,65,4151351,45,3970452,24,4551217
39,2022,2021,46007,CAPANNORI,LU,33972,,,7756,35958963,4476,56354597,11275,229850856,8236,281362144,719,45693929,515,47501082,275,59974087
40,2022,2021,49004,CAPOLIVERI,LI,2992,0,0,957,4523107,402,4967781,746,15090666,593,21386379,85,5418203,61,5912007,40,7412198
41,2022,2021,51006,CAPOLONA,AR,3948,0,0,793,3787546,576,7266127,1611,32616463,768,25448367,62,3936663,41,3896422,22,5484316
42,2022,2021,48008,CAPRAIA E LIMITE,FI,5782,0,0,1255,6075700,709,8934510,1985,40486610,1455,50070102,111,7155672,85,7848817,47,8688254
43,2022,2021,49005,CAPRAIA ISOLA,LI,305,0,0,102,397582,31,380792,60,1222114,70,2410454,9,557699,8,695388,5,727461
44,2022,2021,51007,CAPRESE MICHELANGELO,AR,1057,0,0,304,1447890,164,2063848,373,7480251,181,5966862,6,370663,7,670528,6,999284
45,2022,2021,46008,CAREGGINE,LU,400,0,0,141,661905,66,840221,122,2472524,62,2035043,,,0,0,0,0
46,2022,2021,100002,CARMIGNANO,PO,10868,,,2649,13496893,1360,17185342,3606,73408214,2470,86070002,258,16391721,159,14776406,101,19122437
47,2022,2021,45003,CARRARA,MS,42964,6,-24211,10821,50059309,5286,66057303,12633,259303475,10933,379107772,1059,67302867,774,70662949,378,82975404
48,2022,2021,50006,CASALE MARITTIMO,PI,833,0,0,231,976501,122,1497852,221,4603248,185,6448961,25,1629049,12,1059353,12,2192766
49,2022,2021,50008,CASCINA,PI,32309,,,7147,33703022,3981,50180016,10784,221356440,8348,285675169,701,44423126,505,46254234,150,30193367
50,2022,2021,48041,SCANDICCI,FI,37776,5,-17356,7818,37849897,4470,56242638,13116,269351027,9920,341967207,829,52729865,580,52892997,263,61865997
51,2022,2021,45004,CASOLA IN LUNIGIANA,MS,700,0,0,200,946035,90,1144827,223,4509226,151,4882074,10,643004,5,426292,,
52,2022,2021,52004,CASOLE D'ELSA,SI,2855,,,687,3326219,408,5125175,972,19848824,608,20767124,52,3347690,44,4082430,15,2751691
53,2022,2021,49006,CASTAGNETO CARDUCCI,LI,6862,,,1912,9622736,1101,13834127,2224,45026377,1234,42123744,109,6982167,85,7783765,46,10027954
54,2022,2021,53004,CASTEL DEL PIANO,GR,3570,0,0,921,4508378,586,7335116,1259,25572466,651,22062197,50,3116828,43,3942460,11,1764573
55,2022,2021,48010,CASTELFIORENTINO,FI,12832,,,3108,14971539,1842,23253181,4822,97636760,2435,81809701,178,11336866,125,11737729,68,13054408
56,2022,2021,51008,CASTEL FOCOGNANO,AR,2287,0,0,532,2601015,322,4083382,858,17453875,485,16069748,19,1229126,20,1844199,8,1502412
57,2022,2021,50009,CASTELFRANCO DI SOTTO,PI,9569,,,2259,10682805,1365,17135758,3473,70751449,1936,65528236,149,9389311,118,11046370,63,12166302
58,2022,2021,53005,CASTELL'AZZARA,GR,1087,0,0,287,1450123,221,2783318,381,7502924,159,5253219,14,902224,6,530781,,
59,2022,2021,52005,CASTELLINA IN CHIANTI,SI,2163,0,0,531,2404824,293,3687942,723,14797182,440,15275727,47,3029716,53,4918930,27,5143407
60,2022,2021,50010,CASTELLINA MARITTIMA,PI,1401,0,0,402,1930667,197,2440225,420,8409984,297,10137175,22,1465941,16,1438889,,
61,2022,2021,52006,CASTELNUOVO BERARDENGA,SI,6772,0,0,1338,6070799,729,9225078,2167,44585599,1870,65233093,262,16611887,203,18336257,85,17476605
62,2022,2021,46009,CASTELNUOVO DI GARFAGNANA,LU,4256,0,0,981,4426934,543,6802113,1407,28957002,1087,36519708,67,4156122,67,6128676,32,5542520
63,2022,2021,50011,CASTELNUOVO VAL DI CECINA,PI,1457,0,0,362,1610809,173,2201862,470,9550780,396,13503855,19,1155530,8,787005,6,1458095
64,2022,2021,51010,CASTEL SAN NICCOLO',AR,1938,0,0,499,2471260,308,3883233,720,14510353,324,10827345,16,1018283,21,1883605,11,1805237
65,2022,2021,46010,CASTIGLIONE DI GARFAGNANA,LU,1277,0,0,350,1616420,163,2033201,443,9084139,280,9103214,15,941627,10,928402,,
66,2022,2021,53006,CASTIGLIONE DELLA PESCAIA,GR,5781,,,1674,8539203,980,12218579,1561,31083514,1051,37691179,155,9889172,100,9367650,91,24862748
67,2022,2021,52007,CASTIGLIONE D'ORCIA,SI,1743,0,0,540,2738902,266,3343029,569,11229654,289,9790384,15,958674,14,1310307,10,11031028
68,2022,2021,51011,CASTIGLION FIBOCCHI,AR,1618,0,0,361,1718272,191,2430566,632,12762891,353,11696192,19,1210295,15,1387496,11,2546856
69,2022,2021,51012,CASTIGLION FIORENTINO,AR,9724,,,2388,11027744,1296,16165619,3564,72490420,1942,65891384,164,10356944,104,9544339,49,7955521
70,2022,2021,51013,CAVRIGLIA,AR,7078,0,0,1425,6739483,790,9970502,2659,54778163,1900,64133437,114,7239512,75,7011400,37,7406460
71,2022,2021,49007,CECINA,LI,21029,4,-138693,5611,27625328,2839,35562306,6299,129099648,4870,168097575,443,28301606,339,31174023,150,32138318
72,2022,2021,48011,CERRETO GUIDI,FI,8151,0,0,2102,10316833,1146,14389042,2844,57557677,1539,53251732,120,7552318,99,9016582,85,21591968
73,2022,2021,48012,CERTALDO,FI,11845,,,2856,13900416,1616,20349769,4464,90742482,2293,77214773,183,11784836,128,11882002,75,13722210
74,2022,2021,52008,CETONA,SI,1980,,,565,2687575,343,4290002,613,12200054,347,12051491,31,1916440,25,2294453,15,2946876
75,2022,2021,52009,CHIANCIANO TERME,SI,5474,0,0,1677,7890303,914,11409036,1682,33567537,914,31576988,76,4887351,64,5848036,21,3982443
76,2022,2021,50012,CHIANNI,PI,1009,0,0,293,1322408,164,2061047,325,6541479,180,6083939,8,523114,5,487477,13,2498885
77,2022,2021,47022,CHIESINA UZZANESE,PT,3224,,,901,4415702,486,5999733,1066,21701286,605,20427689,40,2494937,30,2766512,15,2765738
78,2022,2021,51014,CHITIGNANO,AR,660,0,0,175,834677,101,1258569,232,4773552,123,4123843,10,638833,7,641424,5,927002
79,2022,2021,52010,CHIUSDINO,SI,1290,0,0,308,1497213,219,2759501,474,9417053,236,8333056,12,702740,11,1091863,4,1070347
80,2022,2021,52011,CHIUSI,SI,6100,0,0,1546,7188446,888,11212971,2047,41454202,1275,44053962,103,6469737,76,7129212,32,5493856
81,2022,2021,51015,CHIUSI DELLA VERNA,AR,1462,0,0,345,1718231,199,2544431,559,11248880,291,9781748,20,1223576,16,1462158,5,807628
82,2022,2021,53007,CINIGIANO,GR,1868,0,0,548,2747864,324,4014291,679,13548479,245,7964913,17,1088207,8,750510,7,1113477
83,2022,2021,51016,CIVITELLA IN VAL DI CHIANA,AR,6747,,,1448,7008978,933,11858051,2717,54579682,1281,43395746,123,7868326,74,6747193,43,8461017
84,2022,2021,53008,CIVITELLA PAGANICO,GR,2282,0,0,705,3438849,415,5151211,746,14987804,316,10616518,25,1560765,16,1474375,7,1083203
85,2022,2021,52012,COLLE DI VAL D'ELSA,SI,16217,,,3523,17019005,2089,26357031,5840,120044080,3829,130237948,345,21876771,212,19227661,99,19132877
86,2022,2021,49008,COLLESALVETTI,LI,11874,,,2514,12243260,1461,18287275,4060,83816160,3259,111807166,199,12543354,132,12171833,51,8923285
87,2022,2021,45005,COMANO,MS,541,0,0,151,696347,89,1110643,170,3429044,101,3377704,8,526298,7,671654,,
88,2022,2021,46011,COREGLIA ANTELMINELLI,LU,3687,,,906,4307836,515,6480436,1196,24414086,907,30417420,46,2901439,33,3156398,13,7302088
89,2022,2021,51017,CORTONA,AR,16389,,,4310,20580079,2606,32587408,5342,107522564,3106,106212128,279,17692894,210,19198180,92,16764958
90,2022,2021,48013,DICOMANO,FI,4090,0,0,949,4497119,529,6657644,1561,31933538,896,29787645,46,2969650,32,2936596,8,1315341
91,2022,2021,48014,EMPOLI,FI,36143,4,-6438,9038,42867327,4481,56177108,11724,239009176,8204,282112027,814,51529469,645,59697963,385,102681002
92,2022,2021,50014,FAUGLIA,PI,2719,0,0,654,3019812,351,4363389,863,17638642,679,23695116,60,3777450,42,3776476,12,2467668
93,2022,2021,48015,FIESOLE,FI,10357,4,-31748,2266,10133519,1145,14402927,2983,61079188,2726,96516390,375,23981759,338,30880452,224,60116634
94,2022,2021,45006,FILATTIERA,MS,1747,0,0,466,2113476,255,3186654,554,11278832,399,13669675,22,1370499,13,1211617,,
95,2022,2021,48017,FIRENZE,FI,275092,49,-437092,64947,289772302,30237,378602259,74115,1516139717,73258,2604171833,10530,672681938,8872,817194112,4730,1093558829
96,2022,2021,48018,FIRENZUOLA,FI,3455,0,0,816,3951563,493,6181376,1267,25590681,706,23722726,55,3471777,38,3370027,12,2536625
97,2022,2021,45007,FIVIZZANO,MS,5553,0,0,1398,6792604,767,9555496,1954,39698644,1201,40372443,73,4608378,30,2765540,12,2132833
98,2022,2021,51018,FOIANO DELLA CHIANA,AR,6677,0,0,1748,8359378,991,12509838,2515,50640471,1101,37818691,87,5516028,61,5681530,40,7503623
99,2022,2021,53009,FOLLONICA,GR,15868,,,4470,20295394,2117,26293531,4590,93999202,3733,129561042,308,19609845,228,21055846,93,17350257
100,2022,2021,46013,FORTE DEI MARMI,LU,5298,0,0,1430,6786762,634,7924910,1175,23721108,1078,39337050,239,15276226,270,25123601,245,68974844
101,2022,2021,46014,FOSCIANDORA,LU,409,0,0,113,583248,66,840529,119,2471110,88,2971438,8,522530,6,510752,0,0
102,2022,2021,45008,FOSDINOVO,MS,3412,0,0,911,4028212,424,5326032,1011,20584962,825,29048688,77,4810114,59,5346070,15,2858080
103,2022,2021,48019,FUCECCHIO,FI,16551,0,0,4272,20696623,2083,26226145,5849,119283702,3231,111029806,341,21554210,220,20118523,171,39934649
104,2022,2021,52013,GAIOLE IN CHIANTI,SI,1973,0,0,487,2148836,250,3109630,769,15718628,334,11496539,39,2473306,28,2626773,17,3225767
105,2022,2021,46015,GALLICANO,LU,2689,,,662,2998688,367,4601572,899,18498045,667,21910169,26,1612003,19,1767538,,
106,2022,2021,48020,GAMBASSI TERME,FI,3754,0,0,859,3984739,523,6536485,1412,28838734,740,24683945,66,4161494,37,3429817,14,2653759
107,2022,2021,53010,GAVORRANO,GR,6121,0,0,1791,8192005,980,12246165,2033,41349032,1088,35964123,52,3334195,41,3854119,10,2488017
108,2022,2021,48021,GREVE IN CHIANTI,FI,10158,0,0,2484,11559534,1191,14977638,3400,69559727,2356,81327797,235,14846269,185,17193211,69,13424053
109,2022,2021,53011,GROSSETO,GR,61285,6,-43305,15560,72266771,8004,100549840,18067,368170299,15415,537175759,1302,83338221,1076,98049264,423,79328060
110,2022,2021,50015,GUARDISTALLO,PI,881,,,278,1264552,122,1532522,247,5086732,185,6407347,14,896062,7,616548,6,796837
111,2022,2021,48022,IMPRUNETA,FI,11068,,,2529,11558350,1318,16549105,3424,69474804,2663,93161960,353,22472826,285,26357163,183,41166470
112,2022,2021,53012,ISOLA DEL GIGLIO,GR,1104,0,0,363,1751036,166,2034883,239,4899567,239,8608963,29,1822351,21,1942729,6,1407255
113,2022,2021,50016,LAJATICO,PI,1010,,,278,1239540,138,1743685,347,6976924,186,6137474,16,1018680,14,1342553,6,35428820
114,2022,2021,47005,LAMPORECCHIO,PT,5476,0,0,1451,7072948,796,10036698,1883,38175432,1061,35957469,74,4689758,55,5163875,23,3994013
115,2022,2021,47006,LARCIANO,PT,4720,0,0,1161,5706951,711,8868173,1730,35131162,877,29663512,66,4162890,50,4607338,30,5713688
116,2022,2021,48024,LASTRA A SIGNA,FI,14731,0,0,3338,16011636,1900,23841889,5224,106475602,3275,113365092,317,20104074,252,23120325,129,27228623
117,2022,2021,45009,LICCIANA NARDI,MS,3518,,,901,4194323,467,5863203,1169,23525053,797,27072581,48,2965631,29,2725785,14,4145317
118,2022,2021,49009,LIVORNO,LI,111652,20,-156110,25718,117176519,12820,160707741,32770,673755146,31731,1103424653,2848,181667780,2314,211493779,979,213046544
119,2022,2021,48025,LONDA,FI,1333,0,0,306,1300859,168,2116449,480,9724614,300,10279156,22,1395714,14,1306813,11,2956490
120,2022,2021,49013,PORTO AZZURRO,LI,2880,0,0,970,4828558,424,5208307,727,14709286,580,19932788,58,3661185,43,3767275,17,5877871
121,2022,2021,51020,LORO CIUFFENNA,AR,4483,0,0,934,4391454,543,6844745,1628,33278179,1067,36510225,87,5518681,71,6494820,35,8298921
122,2022,2021,46017,LUCCA,LU,66164,13,-108015,15330,67163750,7343,92330710,19764,406092946,17660,613529717,2015,128435007,1530,141901569,842,189149898
123,2022,2021,51021,LUCIGNANO,AR,2629,0,0,622,3085362,380,4763177,966,19502844,503,17255201,37,2370917,49,4523378,12,1861298
124,2022,2021,53013,MAGLIANO IN TOSCANA,GR,2688,0,0,850,4228627,519,6517106,792,15911752,362,12236104,37,2399192,26,2388037,25,5625334
125,2022,2021,53014,MANCIANO,GR,5494,,,1865,8906021,1007,12455905,1531,30595702,772,26587176,63,4020143,60,5402207,28,6290717
126,2022,2021,49010,MARCIANA,LI,1676,0,0,492,2520111,304,3767067,475,9514150,297,10327796,40,2517933,24,2157652,11,1946131
127,2022,2021,49011,MARCIANA MARINA,LI,1591,0,0,439,2298064,269,3320787,434,8765246,349,12249419,37,2419731,22,1994012,9,1494513
128,2022,2021,51022,MARCIANO DELLA CHIANA,AR,2552,0,0,582,2826007,378,4774988,1032,20687419,437,14782510,32,2073012,29,2651035,10,1719023
129,2022,2021,47007,MARLIANA,PT,2379,0,0,637,3084441,353,4413698,775,15796975,465,15671664,38,2421045,27,2453796,13,2257121
130,2022,2021,48026,MARRADI,FI,2337,0,0,578,2898380,333,4181480,873,17726403,443,14924906,40,2547172,19,1720578,11,1984181
131,2022,2021,45010,MASSA,MS,47981,9,-75134,12730,60360789,6227,77889164,14859,303407870,10851,369750971,975,62282442,718,66232401,284,51307532
132,2022,2021,47008,MASSA E COZZILE,PT,5593,0,0,1517,7039068,764,9586448,1881,38259847,1092,37426220,97,6164523,73,6706521,30,5997984
133,2022,2021,53015,MASSA MARITTIMA,GR,6272,,,1754,7981107,922,11559345,1991,40372258,1346,45942370,82,5259400,49,4549882,22,4090309
134,2022,2021,46018,MASSAROSA,LU,15793,,,4343,20651756,2268,28350556,5185,105373642,3058,103686164,270,17160274,170,15881307,81,17118455
135,2022,2021,46019,MINUCCIANO,LU,1413,0,0,367,1848646,225,2804100,449,9207016,323,10908075,12,743891,8,759256,4,712822
136,2022,2021,46020,MOLAZZANA,LU,793,0,0,229,1068698,104,1270096,227,4776665,200,6592595,7,464547,9,855431,,
137,2022,2021,47009,MONSUMMANO TERME,PT,15060,,,3933,19144538,2176,27369837,5622,113653955,2601,87581235,201,12852613,139,12956715,47,9185256
138,2022,2021,48027,MONTAIONE,FI,2748,0,0,683,3223275,397,4987043,982,19853004,542,18536195,48,3045265,22,2014569,9,1684941
139,2022,2021,47010,MONTALE,PT,7926,,,1659,8082252,1093,13701478,2904,59201696,1797,60748144,157,10036522,103,9792348,47,8196383
140,2022,2021,53016,MONTE ARGENTARIO,GR,8844,,,2925,13749044,1192,14900866,2235,45091348,1775,62660050,243,15362403,164,15033594,105,24811417
141,2022,2021,46021,MONTECARLO,LU,3208,0,0,852,3913839,472,5920123,938,19210476,702,24393262,68,4316620,60,5641639,36,8521676
142,2022,2021,50019,MONTECATINI VAL DI CECINA,PI,1282,0,0,362,1714608,211,2635776,408,8307593,252,8446641,10,625532,7,657607,5,808178
143,2022,2021,48028,MONTELUPO FIORENTINO,FI,10353,,,2142,10274653,1195,15142595,3724,76409314,2615,90193799,244,15314050,154,14322883,74,16961645
144,2022,2021,51023,MONTEMIGNAIO,AR,413,0,0,104,608988,56,705579,177,3547669,63,2110459,,,,,,
145,2022,2021,100003,MONTEMURLO,PO,14095,0,0,3548,18547943,1855,23288727,4885,99185378,2902,98712805,259,16310929,209,19012981,120,26696234
146,2022,2021,52015,MONTEPULCIANO,SI,10458,,,2622,12390388,1570,19781937,3547,71629382,2065,72168444,202,12745199,139,12841707,75,14202263
147,2022,2021,51024,MONTERCHI,AR,1394,0,0,357,1702122,234,2925499,457,9171932,275,9358266,20,1260745,13,1198773,11,2914374
148,2022,2021,52016,MONTERIGGIONI,SI,7561,,,1442,6582376,820,10325754,2316,47758960,2217,79003951,269,17142460,227,20661725,80,14868831
149,2022,2021,52017,MONTERONI D'ARBIA,SI,6549,0,0,1352,6396511,837,10622578,2422,49435636,1587,54223199,120,7617079,91,8209855,31,6413453
150,2022,2021,53027,MONTEROTONDO MARITTIMO,GR,917,0,0,252,1224657,136,1720227,323,6414607,182,6064723,6,389927,6,588294,,
151,2022,2021,51025,MONTE SAN SAVINO,AR,6588,0,0,1578,7259584,1000,12590930,2397,48049361,1269,43493970,113,7267189,65,5760432,43,6848077
152,2022,2021,50020,MONTESCUDAIO,PI,1613,0,0,405,1864685,220,2787321,516,10474312,375,12818682,35,2252842,18,1647601,6,1039615
153,2022,2021,48030,MONTESPERTOLI,FI,9909,0,0,2341,11024748,1263,15922358,3420,69626298,2154,74162799,233,14615674,154,14301734,85,15866894
154,2022,2021,51026,MONTEVARCHI,AR,17851,,,3947,18936202,2287,28858549,6579,134141562,3960,134525455,354,22379250,234,21309610,134,28900978
155,2022,2021,50021,MONTEVERDI MARITTIMO,PI,533,0,0,160,787558,84,1057828,145,2933292,112,3929065,9,596289,11,932491,,
156,2022,2021,52018,MONTICIANO,SI,1131,,,276,1336280,176,2208515,412,8150944,211,7173197,16,1004120,11,985012,,
157,2022,2021,53017,MONTIERI,GR,847,0,0,268,1228628,141,1763813,276,5542553,126,4391228,7,433331,,,,
158,2022,2021,45011,MONTIGNOSO,MS,7266,0,0,1983,9604120,989,12274651,2251,45833409,1498,51512301,160,10113441,116,10800489,59,12904105
159,2022,2021,50022,MONTOPOLI IN VAL D'ARNO,PI,8137,,,1835,9120206,1052,13168141,2991,61396195,1779,61483777,176,11180570,88,8037806,47,14154603
160,2022,2021,45012,MULAZZO,MS,1811,0,0,536,2404715,270,3368196,548,11114553,392,13353003,26,1656713,11,1012287,,
161,2022,2021,52019,MURLO,SI,1812,0,0,470,2038629,268,3373962,562,11378905,411,14140682,42,2735621,18,1631334,5,799585
162,2022,2021,53018,ORBETELLO,GR,11299,,,3202,15749794,1787,22322566,3264,65574098,2217,77126779,232,14821721,205,19190709,99,22975191
163,2022,2021,50023,ORCIANO PISANO,PI,485,0,0,122,529446,76,962105,159,3190354,98,3301986,6,373854,5,446666,0,0
164,2022,2021,51027,ORTIGNANO RAGGIOLO,AR,642,0,0,144,720711,73,912208,262,5211061,132,4498478,10,626790,10,920064,4,664594
165,2022,2021,50024,PALAIA,PI,3371,0,0,820,3860021,439,5467514,1214,24563714,680,23082252,66,4241247,41,3645767,23,4260981
166,2022,2021,48031,PALAZZUOLO SUL SENIO,FI,897,0,0,214,1181711,121,1533934,325,6584713,190,6276772,13,811121,15,1372846,4,1144984
167,2022,2021,50025,PECCIOLI,PI,3519,,,892,4380230,496,6259068,1325,26643617,628,21311982,47,3021181,38,3540922,16,2659604
168,2022,2021,48032,PELAGO,FI,5904,,,1245,5919691,729,9219379,2184,44895952,1369,46608681,126,7982376,87,7996458,36,6953041
169,2022,2021,46022,PESCAGLIA,LU,2493,,,696,3188463,393,4936368,817,16492469,485,16089666,32,2036935,15,1376579,6,1187520
170,2022,2021,47012,PESCIA,PT,13849,,,3633,17026117,1978,24694643,4407,90109102,2974,101576659,258,16236993,183,16646499,72,18895264
171,2022,2021,52020,PIANCASTAGNAIO,SI,3139,0,0,721,3443922,452,5644210,1254,25388943,594,20205509,39,2485362,25,2328950,16,3116724
172,2022,2021,46023,PIAZZA AL SERCHIO,LU,1613,0,0,462,2233787,193,2403398,514,10434939,382,12518791,16,1016195,11,984699,4,565072
173,2022,2021,52021,PIENZA,SI,1563,0,0,409,1803018,247,3102650,476,9556853,308,10589520,37,2391244,29,2643286,8,2580443
174,2022,2021,46024,PIETRASANTA,LU,17215,5,-37226,4965,23914006,2292,28473563,4858,98103433,3502,121701816,420,26667908,366,33343012,229,48629074
175,2022,2021,47013,PIEVE A NIEVOLE,PT,6711,,,1827,8606422,986,12342305,2229,45163325,1260,43143251,116,7374235,84,7682218,26,6277995
176,2022,2021,46025,PIEVE FOSCIANA,LU,1753,0,0,463,2195310,203,2518739,560,11463590,454,14929406,19,1184962,22,1972688,6,853387
177,2022,2021,51030,PIEVE SANTO STEFANO,AR,2330,0,0,492,2279574,342,4329090,856,17444690,537,17823196,26,1598952,19,1699334,15,3141928
178,2022,2021,49012,PIOMBINO,LI,24907,,,6399,29714723,3579,44431710,7774,160754278,5861,197033975,403,25622646,310,28288496,115,21731619
179,2022,2021,50026,PISA,PI,65584,10,-32421,15650,70755217,6964,87315823,16685,343976491,18186,643202039,2762,176914449,2546,232821706,975,192981254